{"text_format":"1","workbook":"xlsx","n_sheets":6,"sheets":["Input","CEB-FIP","phi(t,to)","ecs(t-ts)","chi(t,t0)","Ec(t)"],"not_rendered":{"charts":8,"images":0,"macros":1,"external_links":0,"defined_names":0,"comments":0,"pivot_tables":0},"unopened":[{"sheet":"phi(t,to)","index":2,"reason":"not_a_worksheet"},{"sheet":"ecs(t-ts)","index":3,"reason":"not_a_worksheet"},{"sheet":"chi(t,t0)","index":4,"reason":"not_a_worksheet"},{"sheet":"Ec(t)","index":5,"reason":"not_a_worksheet"}],"bounds":{"document_bytes":16777216,"sheet_cells":100000,"rows_first":2000,"rows_last":500,"rows_between":2000,"halvings":0,"cell_chars":16384,"cell_head_chars":4096},"cells_cut":0,"cells_raw":0,"read":"whole","date_system":"1900"}

{"sheet":"Input","index":0,"n_rows":12,"n_cols":52,"rows_kept":12,"cut":false,"hidden":false,"merged":[]}
[]
[null,null,null,null,null,null,null,null,null,null,null,null,null,null,null,null,null,null,null,null,null,null,null,null,null,null,null,null,null,null,null,null,null,null,null,null,null,null,null,null,null,null,null,null,null,null,null,null,null,null,"s","βsc"]
[null,null,null,null,null,null,null,null,null,null,null,null,null,null,null,null,null,null,null,null,null,null,null,null,null,null,null,null,null,null,null,null,null,null,null,null,null,null,null,null,null,null,null,null,null,null,null,null,null,"rapid hardening high-strength cement",0.2,8]
[null,null,null,null,null,null,null,null,null,null,null,null,null,null,null,null,null,null,null,null,null,null,null,null,null,null,null,null,null,null,null,null,null,null,null,null,null,null,null,null,null,null,null,null,null,null,null,null,null,"normal and rapid hardening cement",0.25,5]
[null,null,null,null,null,null,null,null,null,null,null,null,null,null,null,null,null,null,null,null,null,null,null,null,null,null,null,null,null,null,null,null,null,null,null,null,null,null,null,null,null,null,null,null,null,null,null,null,null,"slowly hardening cement",0.38,4]
[]
[null,null,null,null,"fck =",{"$f":"7*6.89476","v":48.26332},"MPa"]
[null,null,null,null,"type of cement =","normal and rapid hardening cement"]
[null,null,null,null,"RH =",0.7]
[null,null,null,null,"h0 = 2Ac/u =",{"$f":"2*1058.58/278.57*25.4","v":193.0425530387335},"mm"]
[null,null,null,null,"t0 (creep) =",7,"days"]
[null,null,null,null,"ts (shrinkage) =",3,"days"]

{"sheet":"CEB-FIP","index":1,"n_rows":83,"n_cols":582,"rows_kept":83,"cut":false,"hidden":true,"merged":[[13,3,14,3],[13,5,14,5],[13,7,14,7],[13,6,14,6]]}
[]
[null,null,null,null,null,null,null,null,null,null,null,null,null,null,null,"fcm0 =",10,"MPa"]
[null,null,null,null,null,null,null,null,null,null,null,null,null,null,null,"fck0 =",10,"MPa"]
[null,null,null,null,null,null,null,null,null,null,null,null,null,null,null,"href =",100,"mm"]
[]
[]
[null,null,null,null,null,null,null,null,null,null,null,null,null,null,null,"fck =","characteristic compressive strength of cylinders"]
[null,null,null,null,null,null,null,null,null,null,null,null,null,null,null,"fcm =","mean compressive strength of concrete at age of 28 days"]
[]
[]
[]
[]
[]
[null,null,null,"Step","t","Φ(t,t0)","Γ(t,t0)","Χ(t,t0)","t-ts","εcs(t-ts)"]
[null,null,null,null,"(days)",null,null,null,"(days)","(10-6)",null,null,null,null,null,"fcm =",{"$f":"+Input!F7+8","v":56.26332},"MPa","s =",{"$f":"+INDEX(Input!$AY$3:$AY$5,MATCH(Input!F8,Input!$AX$3:$AX$5,0))","v":0.25},null,null,null,"βsc =",{"$f":"+INDEX(Input!$AZ$3:$AZ$5,MATCH(Input!F8,Input!$AX$3:$AX$5,0))","v":5}]
[null,null,null,{"$f":"+N28","v":1},{"$f":"+O28","v":7},{"$f":"+V28","v":0},{"$f":"+AL28","v":33746.34702461557},{"$f":"+AN28","v":0},{"$f":"+Y28","v":0},{"$f":"-AA28","v":0},null,null,null,null,null,"Ec(28) =",{"$f":"21500*(Q15/Q2)^(1/3)","v":38239.620927599426},"MPa","ΦRH =",{"$f":"1+(1-Input!F9)/(0.46*(Input!F10/Q4)^(1/3))","v":1.5237761738514843},null,null,null,"εs(fcm) =",{"$f":"+(160+10*Y15*(9-Q15/Q2))*0.000001","v":3.286834E-4}]
[null,null,null,2,{"$f":"+O29","v":7},{"$f":"+V29","v":0},{"$f":"+AL29","v":31448.848990024118},{"$f":"+AN29","v":0.81090764152452266},{"$f":"+Y29","v":0},{"$f":"-AA29","v":0},null,null,null,null,null,"fctk, min =",{"$f":"0.95*(Input!F7/Q3)^(2/3)","v":2.7131162396591955},"MPa","β(fcm) =",{"$f":"5.3/SQRT(Q15/Q2)","v":2.2344116745031566},null,null,null,"βRH =",{"$f":"+IF(AND(Input!F9>=0.4,Input!F9<0.99),-1.55*(1-Input!F9^3),IF(Input!F9>=0.99,0.25,\"N/A\"))","v":-1.0183500000000001}]
[null,null,null,3,7.01,7.2059632372622501E-2,31259.745986532806,0.84185143292488362,9.9999999999997868E-3,0.9268001574357918,null,null,null,null,null,"fctk, max =",{"$f":"1.85*(Input!F7/Q3)^(2/3)","v":5.2834368877573814},"MPa","β(t0) =",{"$f":"1/(0.1+Input!F11^0.2)","v":0.63460910768913126},null,null,null,"εcs0 =",{"$f":"+Y16*Y17","v":-3.3471474039000002E-4}]
[null,null,null,4,7.013335214321633,7.8558151376995913E-2,31055.242528950253,0.86353927649443385,1.3335214321632982E-2,1.0702507568505277,null,null,null,null,null,null,null,null,"Φ0 =",{"$f":"+T16*T17*T18","v":2.1606810898709492}]
[null,null,null,5,7.0177827941003885,8.5642671418999727E-2,30834.28614655096,0.87794008430870463,1.7782794100388966E-2,1.2359041859411535,null,null,null,null,null,null,null,null,"βH =",{"$f":"+MIN(1500,150*Input!F10/Q4*(1+(0.012*(Input!F9*100))^18)+250)","v":552.11752131442199},"mm"]
[null,null,null,6,7.0237137370566156,9.3366011392044382E-2,30596.051644860483,0.88756266023883335,2.3713737056616058E-2,1.4271966438593682,null,null,null,null,null,null,null,null,"βcc(t0) =",{"$f":"+EXP($T$15*(1-SQRT(28/Input!F11)))","v":0.77880078307140488}]
[null,null,null,7,7.0316227766016821,0.10178574033465058,30339.6671970059,0.89405135192582641,3.1622776601683E-2,1.648095976119877,null,null,null,null,null,null,null,null,"βE(t0) =",{"$f":"+SQRT(T21)","v":0.88249690258459546}]
[null,null,null,8,7.0421696503428564,0.11096459978612504,30064.217499189876,0.89845283911602358,4.2169650342857246E-2,1.9031838476112295,null,null,null,null,null,null,null,null,"Ec(t0) =",{"$f":"+T22*Q16","v":33746.34702461557},"MPa"]
[null,null,null,9,7.0562341325190321,0.12097096149560674,29768.760808856383,0.90143725197098235,5.623413251903342E-2,2.1977505717436143]
[null,null,null,10,7.0749894209332416,0.13187932243240463,29452.344466074315,0.90343554332559162,7.4989420933243789E-2,2.5379045207995286,null,null,null,null,null,null,null,null,null,null,null,null,null,null,null,null,null,null,null,null,null,null,null,null,null,null,null,null,null,null,null,null,1,null,null,null,null,null,null,null,null,null,{"$f":"+AQ25+1","v":2},null,null,null,null,null,null,null,null,null,{"$f":"+BA25+1","v":3},null,null,null,null,null,null,null,null,null,{"$f":"+BK25+1","v":4},null,null,null,null,null,null,null,null,null,5,null,null,null,null,null,null,null,null,null,6,null,null,null,null,null,null,null,null,null,7,null,null,null,null,null,null,null,null,null,8,null,null,null,null,null,null,null,null,null,{"$f":"+DI25+1","v":9},null,null,null,null,null,null,null,null,null,10,null,null,null,null,null,null,null,null,null,11,null,null,null,null,null,null,null,null,null,12,null,null,null,null,null,null,null,null,null,13,null,null,null,null,null,null,null,null,null,14,null,null,null,null,null,null,null,null,null,{"$f":"+FQ25+1","v":15},null,null,null,null,null,null,null,null,null,16,null,null,null,null,null,null,null,null,null,{"$f":"+GK25+1","v":17},null,null,null,null,null,null,null,null,null,{"$f":"+GU25+1","v":18},null,null,null,null,null,null,null,null,null,{"$f":"+HE25+1","v":19},null,null,null,null,null,null,null,null,null,{"$f":"+HO25+1","v":20},null,null,null,null,null,null,null,null,null,{"$f":"+HY25+1","v":21},null,null,null,null,null,null,null,null,null,{"$f":"+II25+1","v":22},null,null,null,null,null,null,null,null,null,{"$f":"+IS25+1","v":23},null,null,null,null,null,null,null,null,null,{"$f":"+JC25+1","v":24},null,null,null,null,null,null,null,null,null,{"$f":"+JM25+1","v":25},null,null,null,null,null,null,null,null,null,{"$f":"+JW25+1","v":26},null,null,null,null,null,null,null,null,null,{"$f":"+KG25+1","v":27},null,null,null,null,null,null,null,null,null,{"$f":"+KQ25+1","v":28},null,null,null,null,null,null,null,null,null,{"$f":"+LA25+1","v":29},null,null,null,null,null,null,null,null,null,{"$f":"+LK25+1","v":30},null,null,null,null,null,null,null,null,null,{"$f":"+LU25+1","v":31},null,null,null,null,null,null,null,null,null,{"$f":"+ME25+1","v":32},null,null,null,null,null,null,null,null,null,{"$f":"+MO25+1","v":33},null,null,null,null,null,null,null,null,null,{"$f":"+MY25+1","v":34},null,null,null,null,null,null,null,null,null,{"$f":"+NI25+1","v":35},null,null,null,null,null,null,null,null,null,{"$f":"+NS25+1","v":36},null,null,null,null,null,null,null,null,null,{"$f":"+OC25+1","v":37},null,null,null,null,null,null,null,null,null,{"$f":"+OM25+1","v":38},null,null,null,null,null,null,null,null,null,{"$f":"+OW25+1","v":39},null,null,null,null,null,null,null,null,null,{"$f":"+PG25+1","v":40},null,null,null,null,null,null,null,null,null,{"$f":"+PQ25+1","v":41},null,null,null,null,null,null,null,null,null,{"$f":"+QA25+1","v":42},null,null,null,null,null,null,null,null,null,{"$f":"+QK25+1","v":43},null,null,null,null,null,null,null,null,null,{"$f":"+QU25+1","v":44},null,null,null,null,null,null,null,null,null,{"$f":"+RE25+1","v":45},null,null,null,null,null,null,null,null,null,{"$f":"+RO25+1","v":46},null,null,null,null,null,null,null,null,null,{"$f":"+RY25+1","v":47},null,null,null,null,null,null,null,null,null,{"$f":"+SI25+1","v":48},null,null,null,null,null,null,null,null,null,{"$f":"+SS25+1","v":49},null,null,null,null,null,null,null,null,null,{"$f":"+TC25+1","v":50},null,null,null,null,null,null,null,null,null,{"$f":"+TM25+1","v":51},null,null,null,null,null,null,null,null,null,{"$f":"+TW25+1","v":52},null,null,null,null,null,null,null,null,null,{"$f":"+UG25+1","v":53},null,null,null,null,null,null,null,null,null,{"$f":"+UQ25+1","v":54}]
[null,null,null,11,7.0999999999999943,0.14377083865959461,29114.018382594651,0.90472322809963934,9.9999999999997424E-2,2.930698322240854,null,null,null,"Step","t","βcc(t)","fcm(t)","βE(t)","Ec(t)","t-t0","βc(t-t0)","Φ(t,t0)",null,"t","t-ts","βs(t-ts)","εcs(t-ts)",null,"ti","ti+1/2","ti+1/2-ti","β(ti)","βc(ti+1/2-ti)","βE(ti)","Φ(ti+1/2,ti)","Ec(ti)","(∆σc)i","∑(∆σc)i","Γ(t,t0)/Ec(t0)","Χ(t,t0)",null,null,"(∆σc)j","tj","ti+1/2","ti+1/2-tj","β(tj)","βc(ti+1/2-tj)","βE(tj)","Φ(ti+1/2,tj)","Ec(tj)",null,"(∆σc)j","tj","ti+1/2","ti+1/2-tj","β(tj)","βc(ti+1/2-tj)","βE(tj)","Φ(ti+1/2,tj)","Ec(tj)",null,"(∆σc)j","tj","ti+1/2","ti+1/2-tj","β(tj)","βc(ti+1/2-tj)","βE(tj)","Φ(ti+1/2,tj)","Ec(tj)",null,"(∆σc)j","tj","ti+1/2","ti+1/2-tj","β(tj)","βc(ti+1/2-tj)","βE(tj)","Φ(ti+1/2,tj)","Ec(tj)",null,"(∆σc)j","tj","ti+1/2","ti+1/2-tj","β(tj)","βc(ti+1/2-tj)","βE(tj)","Φ(ti+1/2,tj)","Ec(tj)",null,"(∆σc)j","tj","ti+1/2","ti+1/2-tj","β(tj)","βc(ti+1/2-tj)","βE(tj)","Φ(ti+1/2,tj)","Ec(tj)",null,"(∆σc)j","tj","ti+1/2","ti+1/2-tj","β(tj)","βc(ti+1/2-tj)","βE(tj)","Φ(ti+1/2,tj)","Ec(tj)",null,"(∆σc)j","tj","ti+1/2","ti+1/2-tj","β(tj)","βc(ti+1/2-tj)","βE(tj)","Φ(ti+1/2,tj)","Ec(tj)",null,"(∆σc)j","tj","ti+1/2","ti+1/2-tj","β(tj)","βc(ti+1/2-tj)","βE(tj)","Φ(ti+1/2,tj)","Ec(tj)",null,"(∆σc)j","tj","ti+1/2","ti+1/2-tj","β(tj)","βc(ti+1/2-tj)","βE(tj)","Φ(ti+1/2,tj)","Ec(tj)",null,"(∆σc)j","tj","ti+1/2","ti+1/2-tj","β(tj)","βc(ti+1/2-tj)","βE(tj)","Φ(ti+1/2,tj)","Ec(tj)",null,"(∆σc)j","tj","ti+1/2","ti+1/2-tj","β(tj)","βc(ti+1/2-tj)","βE(tj)","Φ(ti+1/2,tj)","Ec(tj)",null,"(∆σc)j","tj","ti+1/2","ti+1/2-tj","β(tj)","βc(ti+1/2-tj)","βE(tj)","Φ(ti+1/2,tj)","Ec(tj)",null,"(∆σc)j","tj","ti+1/2","ti+1/2-tj","β(tj)","βc(ti+1/2-tj)","βE(tj)","Φ(ti+1/2,tj)","Ec(tj)",null,"(∆σc)j","tj","ti+1/2","ti+1/2-tj","β(tj)","βc(ti+1/2-tj)","βE(tj)","Φ(ti+1/2,tj)","Ec(tj)",null,"(∆σc)j","tj","ti+1/2","ti+1/2-tj","β(tj)","βc(ti+1/2-tj)","βE(tj)","Φ(ti+1/2,tj)","Ec(tj)",null,"(∆σc)j","tj","ti+1/2","ti+1/2-tj","β(tj)","βc(ti+1/2-tj)","βE(tj)","Φ(ti+1/2,tj)","Ec(tj)",null,"(∆σc)j","tj","ti+1/2","ti+1/2-tj","β(tj)","βc(ti+1/2-tj)","βE(tj)","Φ(ti+1/2,tj)","Ec(tj)",null,"(∆σc)j","tj","ti+1/2","ti+1/2-tj","β(tj)","βc(ti+1/2-tj)","βE(tj)","Φ(ti+1/2,tj)","Ec(tj)",null,"(∆σc)j","tj","ti+1/2","ti+1/2-tj","β(tj)","βc(ti+1/2-tj)","βE(tj)","Φ(ti+1/2,tj)","Ec(tj)",null,"(∆σc)j","tj","ti+1/2","ti+1/2-tj","β(tj)","βc(ti+1/2-tj)","βE(tj)","Φ(ti+1/2,tj)","Ec(tj)",null,"(∆σc)j","tj","ti+1/2","ti+1/2-tj","β(tj)","βc(ti+1/2-tj)","βE(tj)","Φ(ti+1/2,tj)","Ec(tj)",null,"(∆σc)j","tj","ti+1/2","ti+1/2-tj","β(tj)","βc(ti+1/2-tj)","βE(tj)","Φ(ti+1/2,tj)","Ec(tj)",null,"(∆σc)j","tj","ti+1/2","ti+1/2-tj","β(tj)","βc(ti+1/2-tj)","βE(tj)","Φ(ti+1/2,tj)","Ec(tj)",null,"(∆σc)j","tj","ti+1/2","ti+1/2-tj","β(tj)","βc(ti+1/2-tj)","βE(tj)","Φ(ti+1/2,tj)","Ec(tj)",null,"(∆σc)j","tj","ti+1/2","ti+1/2-tj","β(tj)","βc(ti+1/2-tj)","βE(tj)","Φ(ti+1/2,tj)","Ec(tj)",null,"(∆σc)j","tj","ti+1/2","ti+1/2-tj","β(tj)","βc(ti+1/2-tj)","βE(tj)","Φ(ti+1/2,tj)","Ec(tj)",null,"(∆σc)j","tj","ti+1/2","ti+1/2-tj","β(tj)","βc(ti+1/2-tj)","βE(tj)","Φ(ti+1/2,tj)","Ec(tj)",null,"(∆σc)j","tj","ti+1/2","ti+1/2-tj","β(tj)","βc(ti+1/2-tj)","βE(tj)","Φ(ti+1/2,tj)","Ec(tj)",null,"(∆σc)j","tj","ti+1/2","ti+1/2-tj","β(tj)","βc(ti+1/2-tj)","βE(tj)","Φ(ti+1/2,tj)","Ec(tj)",null,"(∆σc)j","tj","ti+1/2","ti+1/2-tj","β(tj)","βc(ti+1/2-tj)","βE(tj)","Φ(ti+1/2,tj)","Ec(tj)",null,"(∆σc)j","tj","ti+1/2","ti+1/2-tj","β(tj)","βc(ti+1/2-tj)","βE(tj)","Φ(ti+1/2,tj)","Ec(tj)",null,"(∆σc)j","tj","ti+1/2","ti+1/2-tj","β(tj)","βc(ti+1/2-tj)","βE(tj)","Φ(ti+1/2,tj)","Ec(tj)",null,"(∆σc)j","tj","ti+1/2","ti+1/2-tj","β(tj)","βc(ti+1/2-tj)","βE(tj)","Φ(ti+1/2,tj)","Ec(tj)",null,"(∆σc)j","tj","ti+1/2","ti+1/2-tj","β(tj)","βc(ti+1/2-tj)","βE(tj)","Φ(ti+1/2,tj)","Ec(tj)",null,"(∆σc)j","tj","ti+1/2","ti+1/2-tj","β(tj)","βc(ti+1/2-tj)","βE(tj)","Φ(ti+1/2,tj)","Ec(tj)",null,"(∆σc)j","tj","ti+1/2","ti+1/2-tj","β(tj)","βc(ti+1/2-tj)","βE(tj)","Φ(ti+1/2,tj)","Ec(tj)",null,"(∆σc)j","tj","ti+1/2","ti+1/2-tj","β(tj)","βc(ti+1/2-tj)","βE(tj)","Φ(ti+1/2,tj)","Ec(tj)",null,"(∆σc)j","tj","ti+1/2","ti+1/2-tj","β(tj)","βc(ti+1/2-tj)","βE(tj)","Φ(ti+1/2,tj)","Ec(tj)",null,"(∆σc)j","tj","ti+1/2","ti+1/2-tj","β(tj)","βc(ti+1/2-tj)","βE(tj)","Φ(ti+1/2,tj)","Ec(tj)",null,"(∆σc)j","tj","ti+1/2","ti+1/2-tj","β(tj)","βc(ti+1/2-tj)","βE(tj)","Φ(ti+1/2,tj)","Ec(tj)",null,"(∆σc)j","tj","ti+1/2","ti+1/2-tj","β(tj)","βc(ti+1/2-tj)","βE(tj)","Φ(ti+1/2,tj)","Ec(tj)",null,"(∆σc)j","tj","ti+1/2","ti+1/2-tj","β(tj)","βc(ti+1/2-tj)","βE(tj)","Φ(ti+1/2,tj)","Ec(tj)",null,"(∆σc)j","tj","ti+1/2","ti+1/2-tj","β(tj)","βc(ti+1/2-tj)","βE(tj)","Φ(ti+1/2,tj)","Ec(tj)",null,"(∆σc)j","tj","ti+1/2","ti+1/2-tj","β(tj)","βc(ti+1/2-tj)","βE(tj)","Φ(ti+1/2,tj)","Ec(tj)",null,"(∆σc)j","tj","ti+1/2","ti+1/2-tj","β(tj)","βc(ti+1/2-tj)","βE(tj)","Φ(ti+1/2,tj)","Ec(tj)",null,"(∆σc)j","tj","ti+1/2","ti+1/2-tj","β(tj)","βc(ti+1/2-tj)","βE(tj)","Φ(ti+1/2,tj)","Ec(tj)",null,"(∆σc)j","tj","ti+1/2","ti+1/2-tj","β(tj)","βc(ti+1/2-tj)","βE(tj)","Φ(ti+1/2,tj)","Ec(tj)",null,"(∆σc)j","tj","ti+1/2","ti+1/2-tj","β(tj)","βc(ti+1/2-tj)","βE(tj)","Φ(ti+1/2,tj)","Ec(tj)",null,"(∆σc)j","tj","ti+1/2","ti+1/2-tj","β(tj)","βc(ti+1/2-tj)","βE(tj)","Φ(ti+1/2,tj)","Ec(tj)",null,"(∆σc)j","tj","ti+1/2","ti+1/2-tj","β(tj)","βc(ti+1/2-tj)","βE(tj)","Φ(ti+1/2,tj)","Ec(tj)",null,"(∆σc)j","tj","ti+1/2","ti+1/2-tj","β(tj)","βc(ti+1/2-tj)","βE(tj)","Φ(ti+1/2,tj)","Ec(tj)",null,"(∆σc)j","tj","ti+1/2","ti+1/2-tj","β(tj)","βc(ti+1/2-tj)","βE(tj)","Φ(ti+1/2,tj)","Ec(tj)",null,"(∆σc)j","tj","ti+1/2","ti+1/2-tj","β(tj)","βc(ti+1/2-tj)","βE(tj)","Φ(ti+1/2,tj)","Ec(tj)"]
[null,null,null,12,7.1333521432163245,0.15673389895852102,28752.84693868582,0.90547211612286649,0.13335214321632893,3.384274358849527,null,null,null,null,"(days)",null,"(Mpa)",null,"(Mpa)","(days)",null,null,null,"(days)","(days)",null,"(10-6)",null,"(days)","(days)","(days)",null,null,null,null,"(Mpa)",null,null,null,null,null,null,null,"(days)","(days)","(days)",null,null,null,null,"MPa",null,null,"(days)","(days)","(days)",null,null,null,null,"MPa",null,null,"(days)","(days)","(days)",null,null,null,null,"MPa",null,null,"(days)","(days)","(days)",null,null,null,null,"MPa",null,null,"(days)","(days)","(days)",null,null,null,null,"MPa",null,null,"(days)","(days)","(days)",null,null,null,null,"MPa",null,null,"(days)","(days)","(days)",null,null,null,null,"MPa",null,null,"(days)","(days)","(days)",null,null,null,null,"MPa",null,null,"(days)","(days)","(days)",null,null,null,null,"MPa",null,null,"(days)","(days)","(days)",null,null,null,null,"MPa",null,null,"(days)","(days)","(days)",null,null,null,null,"MPa",null,null,"(days)","(days)","(days)",null,null,null,null,"MPa",null,null,"(days)","(days)","(days)",null,null,null,null,"MPa",null,null,"(days)","(days)","(days)",null,null,null,null,"MPa",null,null,"(days)","(days)","(days)",null,null,null,null,"MPa",null,null,"(days)","(days)","(days)",null,null,null,null,"MPa",null,null,"(days)","(days)","(days)",null,null,null,null,"MPa",null,null,"(days)","(days)","(days)",null,null,null,null,"MPa",null,null,"(days)","(days)","(days)",null,null,null,null,"MPa",null,null,"(days)","(days)","(days)",null,null,null,null,"MPa",null,null,"(days)","(days)","(days)",null,null,null,null,"MPa",null,null,"(days)","(days)","(days)",null,null,null,null,"MPa",null,null,"(days)","(days)","(days)",null,null,null,null,"MPa",null,null,"(days)","(days)","(days)",null,null,null,null,"MPa",null,null,"(days)","(days)","(days)",null,null,null,null,"MPa",null,null,"(days)","(days)","(days)",null,null,null,null,"MPa",null,null,"(days)","(days)","(days)",null,null,null,null,"MPa",null,null,"(days)","(days)","(days)",null,null,null,null,"MPa",null,null,"(days)","(days)","(days)",null,null,null,null,"MPa",null,null,"(days)","(days)","(days)",null,null,null,null,"MPa",null,null,"(days)","(days)","(days)",null,null,null,null,"MPa",null,null,"(days)","(days)","(days)",null,null,null,null,"MPa",null,null,"(days)","(days)","(days)",null,null,null,null,"MPa",null,null,"(days)","(days)","(days)",null,null,null,null,"MPa",null,null,"(days)","(days)","(days)",null,null,null,null,"MPa",null,null,"(days)","(days)","(days)",null,null,null,null,"MPa",null,null,"(days)","(days)","(days)",null,null,null,null,"MPa",null,null,"(days)","(days)","(days)",null,null,null,null,"MPa",null,null,"(days)","(days)","(days)",null,null,null,null,"MPa",null,null,"(days)","(days)","(days)",null,null,null,null,"MPa",null,null,"(days)","(days)","(days)",null,null,null,null,"MPa",null,null,"(days)","(days)","(days)",null,null,null,null,"MPa",null,null,"(days)","(days)","(days)",null,null,null,null,"MPa",null,null,"(days)","(days)","(days)",null,null,null,null,"MPa",null,null,"(days)","(days)","(days)",null,null,null,null,"MPa",null,null,"(days)","(days)","(days)",null,null,null,null,"MPa",null,null,"(days)","(days)","(days)",null,null,null,null,"MPa",null,null,"(days)","(days)","(days)",null,null,null,null,"MPa",null,null,"(days)","(days)","(days)",null,null,null,null,"MPa",null,null,"(days)","(days)","(days)",null,null,null,null,"MPa",null,null,"(days)","(days)","(days)",null,null,null,null,"MPa",null,null,"(days)","(days)","(days)",null,null,null,null,"MPa",null,null,"(days)","(days)","(days)",null,null,null,null,"MPa",null,null,"(days)","(days)","(days)",null,null,null,null,"MPa"]
[null,null,null,13,7.1778279410038817,0.17086473798908905,28367.919356911563,0.9057827682160422,0.17782794100388788,3.9080324370061144,null,null,null,1,{"$f":"+Input!$F$11","v":7},{"$f":"+EXP($T$15*(1-SQRT(28/O28)))","v":0.77880078307140488},{"$f":"+P28*$Q$15","v":43.817917674197034},{"$f":"+SQRT(P28)","v":0.88249690258459546},{"$f":"+R28*$Q$16","v":33746.34702461557},{"$f":"+O28-Input!$F$11","v":0},{"$f":"+(T28/($T$20+T28))^0.3","v":0},{"$f":"+$T$19*U28*$T$22","v":0},null,{"$f":"+Input!$F$12","v":3},{"$f":"+X28-Input!$F$12","v":0},{"$f":"+SQRT(Y28/(350*(Input!$F$10/$Q$4)^2+Y28))","v":0},{"$f":"+$Y$18*Z28*1000000","v":0},1,{"$f":"+(O28+O29)/2","v":7},{"$f":"+O29","v":7},null,null,null,{"$f":"+SQRT(EXP($T$15*(1-SQRT(28/AC28))))","v":0.88249690258459546},null,{"$f":"+AH28*$Q$16","v":33746.34702461557},{"$f":"+T23","v":33746.34702461557},{"$f":"+AK28","v":33746.34702461557},{"$f":"+AL28/$T$23","v":1},0,null,1]
[null,null,null,14,7.2371373705661517,0.18626808703637115,27958.358227592536,0.90570510538900262,0.23713737056615969,4.5128228641403254,null,null,null,{"$f":"+N28+1","v":2},{"$f":"+O28","v":7},0.77880078307140488,{"$f":"+P29*$Q$15","v":43.817917674197034},0.88249690258459546,{"$f":"+R29*$Q$16","v":33746.34702461557},{"$f":"+O29-Input!$F$11","v":0},0,0,null,{"$f":"+X28","v":3},{"$f":"+X29-Input!$F$12","v":0},{"$f":"+SQRT(Y29/(350*(Input!$F$10/$Q$4)^2+Y29))","v":0},0,{"$f":"+AB28+1","v":2},7.0049999999999999,7.01,{"$f":"+AD29-AC29","v":4.9999999999998934E-3},{"$f":"1/(0.1+AC29^0.2)","v":0.63452423811239644},{"$f":"+(AE29/($T$20+AE29))^0.3","v":3.0695899375847619E-2},{"$f":"+SQRT(EXP($T$15*(1-SQRT(28/AC29))))","v":0.88257565827868456},{"$f":"+$T$16*$T$17*AF29*AG29*AH29","v":5.8528163163917998E-2},{"$f":"+AH29*$Q$16","v":33749.358612503427},{"$f":"+AJ29/(1+AI29)*(1-(AZ29+BJ29+BT29+CD29+CN29+CX29+DH29+DR29+EB29+EL29+EV29+FF29+FP29+FZ29+GJ29+GT29+HD29+HN29+HX29+IH29+IR29+JB29+JL29+JV29+KF29+KP29+KZ29+LJ29+LT29+MD29+MN29+MX29+NH29+NR29+OB29+OL29+OV29+PF29+PP29+PZ29+QJ29+QT29+RD29+RN29+RX29+SH29+SR29+TB29+TL29+TV29+UF29+UP29+UZ29))","v":-2297.498034591451},{"$f":"+AL28+AK29","v":31448.848990024118},{"$f":"+AL29/$T$23","v":0.93191861528254927},{"$f":"1/(1-AM29)-1/V30","v":0.81090764152452266},null,{"$f":"+AP28+1","v":2},{"$f":"+INDEX($AK$28:$AK$82,MATCH(AQ$25,$N$28:$N$82,0))","v":33746.34702461557},{"$f":"+INDEX($AC$28:$AC$82,MATCH(AQ$25,$N$28:$N$82,0))","v":7},{"$f":"+$AD29","v":7.01},{"$f":"+AS29-AR29","v":9.9999999999997868E-3},{"$f":"1/(0.1+AR29^0.2)","v":0.63460910768913126},{"$f":"+(AT29/($T$20+AT29))^0.3","v":3.7790982359399622E-2},{"$f":"+SQRT(EXP($T$15*(1-SQRT(28/AR29))))","v":0.88249690258459546},{"$f":"+$T$16*$T$17*AU29*AV29*AW29","v":7.2059632372622501E-2},{"$f":"+INDEX($AJ$28:$AJ$82,MATCH(AQ$25,$N$28:$N$82,0))","v":33746.34702461557},{"$f":"+AQ29*(1+AX29)/AY29","v":1.0720596323726226}]
[null,null,null,15,7.3162277660168193,0.20305785773386231,27523.325593007095,0.9052516428974835,0.31622776601683,5.2111685755789434,null,null,null,{"$f":"+N29+1","v":3},{"$f":"+O29+0.01","v":7.01},0.77907867812010667,43.833552972248562,0.8826543367140427,33752.367246046699,{"$f":"+O30-Input!$F$11","v":9.9999999999997868E-3},3.7790982359399622E-2,7.2059632372622501E-2,null,{"$f":"+X29+0.01","v":3.01},{"$f":"+X30-Input!$F$12","v":9.9999999999997868E-3},{"$f":"+SQRT(Y30/(350*(Input!$F$10/$Q$4)^2+Y30))","v":2.7689254329101576E-3},-0.9268001574357918,{"$f":"+AB29+1","v":3},7.0116676071608168,7.013335214321633,{"$f":"+AD30-AC30","v":1.6676071608161536E-3},{"$f":"1/(0.1+AC30^0.2)","v":0.63441117335895136},{"$f":"+(AE30/($T$20+AE30))^0.3","v":2.2080976371146969E-2},{"$f":"+SQRT(EXP($T$15*(1-SQRT(28/AC30))))","v":0.88268056049996957},{"$f":"+$T$16*$T$17*AF30*AG30*AH30","v":4.2099508805456674E-2},{"$f":"+AH30*$Q$16","v":33753.370033679828},-189.10300349131211,{"$f":"+AL29+AK30","v":31259.745986532806},{"$f":"+AL30/$T$23","v":0.92631495680794829},{"$f":"1/(1-AM30)-1/V31","v":0.84185143292488362},null,{"$f":"+AP29+1","v":3},{"$f":"+INDEX($AK$28:$AK$82,MATCH(AQ$25,$N$28:$N$82,0))","v":33746.34702461557},7,{"$f":"+$AD30","v":7.013335214321633},{"$f":"+AS30-AR30","v":1.3335214321632982E-2},0.63460910768913126,4.1199068259513145E-2,0.88249690258459546,7.8558151376995913E-2,33746.34702461557,{"$f":"+AQ30*(1+AX30)/AY30","v":1.078558151376996},{"$f":"+INDEX($AK$28:$AK$82,MATCH(BA$25,$N$28:$N$82,0))","v":-2297.498034591451},{"$f":"+INDEX($AC$28:$AC$82,MATCH(BA$25,$N$28:$N$82,0))","v":7.0049999999999999},{"$f":"+$AD30","v":7.013335214321633},{"$f":"+BC30-BB30","v":8.3352143216330887E-3},{"$f":"1/(0.1+BB30^0.2)","v":0.63452423811239644},{"$f":"+(BD30/($T$20+BD30))^0.3","v":3.5781917130540193E-2},{"$f":"+SQRT(EXP($T$15*(1-SQRT(28/BB30))))","v":0.88257565827868456},{"$f":"+$T$16*$T$17*BE30*BF30*BG30","v":6.8225721569242004E-2},{"$f":"+INDEX($AJ$28:$AJ$82,MATCH(BA$25,$N$28:$N$82,0))","v":33749.358612503427},{"$f":"+BA30*(1+BH30)/BI30","v":-7.2719796662924482E-2}]
{"$rows_left_out":53}